Compile Error

classic Classic list List threaded Threaded
3 messages Options
Helijah Helijah
Reply | Threaded
Open this post in threaded view
|

Compile Error

goodnight to all,

Always fully convinced by your fantastisque work! Bravo

Se evening the following error at compile: (I know you are very responsive when I show you :)

[ 90%] Building CXX object src/osgPlugins/osg/CMakeFiles/osgdb_osgearth_osg.dir/ReaderWriterOSG.o                    
/home/helijah/Source-FG/osgearth/src/osgPlugins/osg/ReaderWriterOSG.cpp: In member function 'virtual osg::Image* OSGSource::createImage(const osgEarth::TileKey*)':                                                                        
/home/helijah/Source-FG/osgearth/src/osgPlugins/osg/ReaderWriterOSG.cpp:136: erreur: 'memcpy' was not declared in this scope                                                                                                                
make[2]: *** [src/osgPlugins/osg/CMakeFiles/osgdb_osgearth_osg.dir/ReaderWriterOSG.o] Erreur 1                        
make[1]: *** [src/osgPlugins/osg/CMakeFiles/osgdb_osgearth_osg.dir/all] Erreur 2                                      
make: *** [all] Erreur 2

Best regards. Emmanuel
gwaldron gwaldron
Reply | Threaded
Open this post in threaded view
|

Re: Compile Error

Helijah Helijah
Reply | Threaded
Open this post in threaded view
|

Re: Compile Error

well, with : #include <stdlib.h> in ReaderWriterOSG.cpp same problem.

       
by cons with : #include <string.h> the compilation ends and everything works

Thanks

Best regards. Emmanuel